{"text_format":"1","workbook":"xlsx","n_sheets":3,"sheets":["O pliku","Tabela","Cennik"],"not_rendered":{"charts":0,"images":1,"macros":1,"external_links":0,"defined_names":2,"comments":0,"pivot_tables":0},"unopened":[],"bounds":{"document_bytes":16777216,"sheet_cells":100000,"rows_first":2000,"rows_last":500,"rows_between":2000,"halvings":0,"cell_chars":16384,"cell_head_chars":4096},"cells_cut":0,"cells_raw":0,"read":"whole","date_system":"1900"}

{"sheet":"O pliku","index":0,"n_rows":0,"n_cols":0,"rows_kept":0,"cut":false,"hidden":false,"merged":[]}

{"sheet":"Tabela","index":1,"n_rows":9,"n_cols":9,"rows_kept":9,"cut":false,"hidden":false,"merged":[]}
["http://malinowyexcel.pl/",null,null,null,null,null,null,null,"ukryj"]
[null,"LP.","Nazwa","Model","Jednostkowa cena netto","ilość","Cena netto",null,"Formuła"]
[null,1,"Tablica ","SW 1168S",{"$f":"I3","v":33024},1,{"$f":"E3*F3","v":33024},null,{"$f":"IFERROR((VLOOKUP(D3,Cennik!$B$3:$D$25,3,0)),0)","v":33024}]
[null,2,"Tablica ",null,{"$f":"I4","v":3},null,{"$f":"E4*F4","v":0},null,{"$f":"3","v":3}]
[null,3,"Tablica ",null,{"$f":"I5","v":400},null,0,null,{"$f":"200*2","v":400}]
[null,4,"Tablica ",null,{"$f":"IFERROR((VLOOKUP(D6,Cennik!$B$3:$D$25,3,0)),0)","v":0},null,0,null,{"$f":"IFERROR((VLOOKUP(D6,Cennik!$B$3:$D$25,3,0)),0)","v":0}]
[null,5,"Tablica ",null,{"$f":"IFERROR((VLOOKUP(D7,Cennik!$B$3:$D$25,3,0)),0)","v":0},null,0,null,{"$f":"IFERROR((VLOOKUP(D7,Cennik!$B$3:$D$25,3,0)),0)","v":0}]
[null,6,"Tablica ",null,{"$f":"IFERROR((VLOOKUP(D8,Cennik!$B$3:$D$25,3,0)),0)","v":0},null,0,null,{"$f":"IFERROR((VLOOKUP(D8,Cennik!$B$3:$D$25,3,0)),0)","v":0}]
[null,7,"Tablica ",null,{"$f":"IFERROR((VLOOKUP(D9,Cennik!$B$3:$D$25,3,0)),0)","v":0},null,0,null,{"$f":"IFERROR((VLOOKUP(D9,Cennik!$B$3:$D$25,3,0)),0)","v":0}]

{"sheet":"Cennik","index":2,"n_rows":11,"n_cols":4,"rows_kept":11,"cut":false,"hidden":true,"merged":[]}
[]
["Lp.","Model","Cena w EUR","Cena w PLN"]
[1,"GJ30",240,1032]
[2,"GJ30S",1480,6364]
[3,"GJ30C",2720,11696]
[4,"GJ40C",3960,17028]
[5,"GJ30L",5200,22360]
[6,"GJ30CL",6440,27692]
[7,"SW 1168S",7680,33024]
[8,"SW 1168C",8920,38356]
[9,"SW 0368S",10160,43688]